BDBM50187403 CHEMBL3828521
SMILES CC(C)(C)C(NC(=O)C(CCCc1ccccc1)CC(=O)NO)C(=O)NC1CCCCC1
InChI Key InChIKey=WTMNDZGXJUPIBE-UHFFFAOYSA-N
Data  2 IC50
  Tab Delimited (TSV)   2D SDfile   Computed 3D by Vconf -m prep SDfile
Find this compound or compounds like it in BindingDB:
Activity Spreadsheet -- Enzyme Inhibition Constant Data from BindingDB
Found 2 hits for monomerid = 50187403
Target72 kDa type IV collagenase(Homo sapiens (Human))
Jadavpur University
Curated by ChEMBL
LigandPNGBDBM50187403(CHEMBL3828521)
Affinity DataIC50:  1.30nM. Assay description: Inhibition of human recombinant MMP2 by colorimetric analysis
In DepthDetails ArticlePubMed
Target72 kDa type IV collagenase(Homo sapiens (Human))
Jadavpur University
Curated by ChEMBL
LigandPNGBDBM50187403(CHEMBL3828521)
Affinity DataIC50:  1.30nM. Assay description: Inhibition of human recombinant MMP2 by colorimetric analysis
In DepthDetails ArticlePubMed