BDBM50187495 CHEMBL3828660
SMILES CCCOc1cc(ccc1Cl)S(=O)(=O)Nc1ccc(cc1)C(O)=O
InChI Key InChIKey=OPJAJWGXEYCJNI-UHFFFAOYSA-N
Data  1 KI
  Tab Delimited (TSV)   2D SDfile   Computed 3D by Vconf -m prep SDfile
Find this compound or compounds like it in BindingDB:
Activity Spreadsheet -- Enzyme Inhibition Constant Data from BindingDB
Found 1 hit for monomerid = 50187495
TargetFatty acid-binding protein, adipocyte(Homo sapiens (Human))
Chinese Academy Of Sciences
Curated by ChEMBL
LigandPNGBDBM50187495(CHEMBL3828660)
Affinity DataKi:  4.30E+3nM. Assay description: Displacement of 1,8-ANS from His6-tagged FABP4 (unknown origin) expressed in Escherichia coli BL21(DE3) cells by fluorescence assay
In DepthDetails ArticlePubMed