BDBM50187500 CHEMBL3828526
SMILES CCOC(=O)c1c2CCCCc2sc1\N=c1/scc(-c2ccccc2)n1CC=C
InChI Key InChIKey=XMTJOWLGJSFZED-VHXPQNKSSA-N
Data  1 IC50
  Tab Delimited (TSV)   2D SDfile   Computed 3D by Vconf -m prep SDfile
Find this compound or compounds like it in BindingDB:
Activity Spreadsheet -- Enzyme Inhibition Constant Data from BindingDB
Found 1 hit for monomerid = 50187500
TargetCruzipain(Trypanosoma cruzi)
Federal University Of Alagoas
Curated by ChEMBL
LigandPNGBDBM50187500(CHEMBL3828526)
Affinity DataIC50:  2.40E+3nM. Assay description: Inhibition of Trypanosoma cruzi cruzain using Z-Phe-Arg-aminomethylcoumarin as substrate measured after 5 mins by spectrofluorimetry
In DepthDetails ArticlePubMed