BDBM50187501 CHEMBL3827445
SMILES CCCCCCCCCCCCCCC[C@@H](O)[C@@H](N)CP(O)(O)=O
InChI Key InChIKey=VGXXQGVRVPNKPS-ZWKOTPCHSA-N
Data  2 KI
  Tab Delimited (TSV)   2D SDfile   Computed 3D by Vconf -m prep SDfile
Find this compound or compounds like it in BindingDB:
Activity Spreadsheet -- Enzyme Inhibition Constant Data from BindingDB
Found 2 hits for monomerid = 50187501
TargetSphingosine-1-phosphate lyase 1(Rattus norvegicus)
Spanish National Research Council (Csic)
Curated by ChEMBL
LigandPNGBDBM50187501(CHEMBL3827445)
Affinity DataKi:  5.00E+3nM. Assay description: Competitive inhibition of rat liver microsomal S1PL using varying levels of [3-3H]-D(+) erythro-sphinganine-1-phosphate as substrate incubated for 15...
In DepthDetails ArticlePubMed
TargetSphingosine-1-phosphate lyase 1(Rattus norvegicus)
Spanish National Research Council (Csic)
Curated by ChEMBL
LigandPNGBDBM50187501(CHEMBL3827445)
Affinity DataKi:  5.00E+3nM. Assay description: Competitive inhibition of rat S1PL in presence of D(+)-erythro-sphinganine-1-phosphate measured after 15 mins by Dixon plot analysis
In DepthDetails ArticlePubMed