BDBM50187633 3,4-dimethyl-N-(1,3-diphenyl-1H-pyrazol-5-yl)benzamide::CHEMBL207107
SMILES Cc1ccc(cc1C)C(=O)Nc1cc(nn1-c1ccccc1)-c1ccccc1
InChI Key InChIKey=JTABVHWBBCBYGG-UHFFFAOYSA-N
Data  1 KI  1 EC50
  Tab Delimited (TSV)   2D SDfile   Computed 3D by Vconf -m prep SDfile
Find this compound or compounds like it in BindingDB:
Activity Spreadsheet -- Enzyme Inhibition Constant Data from BindingDB
Found 2 hits for monomerid = 50187633
TargetMetabotropic glutamate receptor 5(Rattus norvegicus (Rat))
Vanderbilt University School Of Medicine
Curated by ChEMBL
LigandPNGBDBM50187633(3,4-dimethyl-N-(1,3-diphenyl-1H-pyrazol-5-yl)benza...)
Affinity DataKi:  430nM. Assay description: Displacement of [3H]methoxyPEPy from rat mGluR5 expressed in HEK293 cells
In DepthDetails ArticlePubMed
TargetMetabotropic glutamate receptor 5(Rattus norvegicus (Rat))
Vanderbilt University School Of Medicine
Curated by ChEMBL
LigandPNGBDBM50187633(3,4-dimethyl-N-(1,3-diphenyl-1H-pyrazol-5-yl)benza...)
Affinity DataEC50:  20nM. Assay description: Activity at mGluR5 assessed as potentiation of glutamate-induced calcium flux in rat astrocytes
In DepthDetails ArticlePubMed