BDBM50187734 CHEMBL3828366
SMILES Cl.CN(C\C=C\c1ccccc1[N+]([O-])=O)Cc1ccc2CCCCCc2c1
InChI Key InChIKey=ANAFIMFZNKCMQI-RVDQCCQOSA-N
Data  1 IC50
  Tab Delimited (TSV)   2D SDfile   Computed 3D by Vconf -m prep SDfile
Find this compound or compounds like it in BindingDB:
Activity Spreadsheet -- Enzyme Inhibition Constant Data from BindingDB
Found 1 hit for monomerid = 50187734
Target4,4'-diapophytoene desaturase (4,4'-diaponeurosporene-forming)(Staphylococcus aureus (strain Newman))
East China University Of Science And Technology
Curated by ChEMBL
LigandPNGBDBM50187734(CHEMBL3828366)
Affinity DataIC50: >5.00E+3nM. Assay description: Inhibition of diapophytoene desaturase in Staphylococcus aureus Newman assessed as reduction in staphyloxanthin pigment formation after 48 hrs by spe...
In DepthDetails ArticlePubMed