BDBM50187873 2-((2-(2-(3-fluorophenylthio)phenoxy)ethyl)(methyl)amino)acetic acid::CHEMBL212502
SMILES CN(CCOc1ccccc1Sc1cccc(F)c1)CC(O)=O
InChI Key InChIKey=IGBUJWFABAMDAC-UHFFFAOYSA-N
Data  1 IC50
  Tab Delimited (TSV)   2D SDfile   Computed 3D by Vconf -m prep SDfile
Find this compound or compounds like it in BindingDB:
Activity Spreadsheet -- Enzyme Inhibition Constant Data from BindingDB
Found 1 hit for monomerid = 50187873
TargetSodium- and chloride-dependent glycine transporter 1(Homo sapiens (Human))
H. Lundbeck
Curated by ChEMBL
LigandPNGBDBM50187873(2-((2-(2-(3-fluorophenylthio)phenoxy)ethyl)(methyl...)
Affinity DataIC50:  5.10E+3nM. Assay description: Inhibition of [3H]glycine uptake at human GlyT1b transporter
In DepthDetails ArticlePubMed