BDBM50187887 2-((2-(2-(4-acetamidophenylthio)phenoxy)ethyl)(methyl)amino)acetic acid::CHEMBL209474
SMILES CN(CCOc1ccccc1Sc1ccc(NC(C)=O)cc1)CC(O)=O
InChI Key InChIKey=AMFGQKPBBLWRQP-UHFFFAOYSA-N
Data  1 IC50
  Tab Delimited (TSV)   2D SDfile   Computed 3D by Vconf -m prep SDfile
Find this compound or compounds like it in BindingDB:
Activity Spreadsheet -- Enzyme Inhibition Constant Data from BindingDB
Found 1 hit for monomerid = 50187887
TargetSodium- and chloride-dependent glycine transporter 1(Homo sapiens (Human))
H. Lundbeck
Curated by ChEMBL
LigandPNGBDBM50187887(2-((2-(2-(4-acetamidophenylthio)phenoxy)ethyl)(met...)
Affinity DataIC50: >5.00E+4nM. Assay description: Inhibition of [3H]glycine uptake at human GlyT1b transporter
In DepthDetails ArticlePubMed