BDBM50187936 (7R,9S,12S)-12-cyclohexyl-11,14-dioxo-2,6-dioxa-10,13-diaza-tricyclo[14.3.1.1*7,10*]henicosa-1(19),16(20),17-triene-9-carboxylic acid [1-((S)-dimethylcarbamoyl-phenyl-methyl)-carbamoyl]-methyl)-aminooxalyl)-butyl)-amide::CHEMBL212533
SMILES CCCC(NC(=O)[C@@H]1C[C@@H]2CN1C(=O)[C@@H](NC(=O)Cc1cccc(OCCCO2)c1)C1CCCCC1)C(=O)C(=O)NCC(=O)N[C@H](C(=O)N(C)C)c1ccccc1
InChI Key InChIKey=XICAUTQYHONJLM-MTFMWLKXSA-N
Data  1 KI
  Tab Delimited (TSV)   2D SDfile   Computed 3D by Vconf -m prep SDfile
Find this compound or compounds like it in BindingDB:
Activity Spreadsheet -- Enzyme Inhibition Constant Data from BindingDB
Found 1 hit for monomerid = 50187936
TargetGenome polyprotein(Hepatitis C virus)
Schering-Plough Research Institute
Curated by ChEMBL
LigandPNGBDBM50187936((7R,9S,12S)-12-cyclohexyl-11,14-dioxo-2,6-dioxa-10...)
Affinity DataKi:  8nM. Assay description: Binding affinity to HCV NS3 protease
In DepthDetails ArticlePubMed