BDBM50187994 3-(4-(5,7-dimethylbenzo[d]oxazol-2-ylamino)phenyl)isothiazolo[5,4-d]pyrimidin-4-amine::CHEMBL211327
SMILES Cc1cc(C)c2oc(Nc3ccc(cc3)-c3nsc4ncnc(N)c34)nc2c1
InChI Key InChIKey=ABQZBBQXRQDXEI-UHFFFAOYSA-N
Data  1 IC50
  Tab Delimited (TSV)   2D SDfile   Computed 3D by Vconf -m prep SDfile
Find this compound or compounds like it in BindingDB:
Activity Spreadsheet -- Enzyme Inhibition Constant Data from BindingDB
Found 1 hit for monomerid = 50187994
TargetVascular endothelial growth factor receptor 2(Homo sapiens (Human))
Abbott Laboratories
Curated by ChEMBL
LigandPNGBDBM50187994(3-(4-(5,7-dimethylbenzo[d]oxazol-2-ylamino)phenyl)...)
Affinity DataIC50:  4.30E+4nM. Assay description: Inhibition of KDR
In DepthDetails ArticlePubMed