BDBM50188002 1-(4-(4-aminoisothiazolo[5,4-d]pyrimidin-3-yl)phenyl)-3-(3-chlorophenyl)urea::CHEMBL379372
SMILES Nc1ncnc2snc(-c3ccc(NC(=O)Nc4cccc(Cl)c4)cc3)c12
InChI Key InChIKey=WPPDVRZORMAVOK-UHFFFAOYSA-N
Data  2 IC50
  Tab Delimited (TSV)   2D SDfile   Computed 3D by Vconf -m prep SDfile
Find this compound or compounds like it in BindingDB:
Activity Spreadsheet -- Enzyme Inhibition Constant Data from BindingDB
Found 2 hits for monomerid = 50188002
TargetVascular endothelial growth factor receptor 2(Homo sapiens (Human))
Abbott Laboratories
Curated by ChEMBL
LigandPNGBDBM50188002(1-(4-(4-aminoisothiazolo[5,4-d]pyrimidin-3-yl)phen...)
Affinity DataIC50:  50nM. Assay description: Inhibition of KDR by cellular assay
In DepthDetails ArticlePubMed
TargetVascular endothelial growth factor receptor 2(Homo sapiens (Human))
Abbott Laboratories
Curated by ChEMBL
LigandPNGBDBM50188002(1-(4-(4-aminoisothiazolo[5,4-d]pyrimidin-3-yl)phen...)
Affinity DataIC50:  19nM. Assay description: Inhibition of KDR
In DepthDetails ArticlePubMed