BDBM50188066 CHEMBL213302::N-(2-(1H-indol-3-yl)ethyl)-4-chloro-N-methylbenzamide
SMILES CN(CCc1c[nH]c2ccccc12)C(=O)c1ccc(Cl)cc1
InChI Key InChIKey=IEAKWXUPKMDFOG-UHFFFAOYSA-N
Data  6 IC50
  Tab Delimited (TSV)   2D SDfile   Computed 3D by Vconf -m prep SDfile
Find this compound or compounds like it in BindingDB:
Activity Spreadsheet -- Enzyme Inhibition Constant Data from BindingDB
Found 6 hits for monomerid = 50188066
TargetCyclin-dependent kinase 4/G1/S-specific cyclin-D1(Homo sapiens (Human))
De Montfort University
Curated by ChEMBL
LigandPNGBDBM50188066(CHEMBL213302 | N-(2-(1H-indol-3-yl)ethyl)-4-chloro...)
Affinity DataIC50:  3.80E+4nM. Assay description: Inhibition of Cdk4/Cyclin D1
In DepthDetails ArticlePubMed
TargetCyclin-A1/Cyclin-A2/Cyclin-dependent kinase 2(Homo sapiens (Human))
De Montfort University
Curated by ChEMBL
LigandPNGBDBM50188066(CHEMBL213302 | N-(2-(1H-indol-3-yl)ethyl)-4-chloro...)
Affinity DataIC50:  7.31E+5nM. Assay description: Inhibition of Cdk2/Cyclin A
In DepthDetails ArticlePubMed
TargetCyclin-A2/Cyclin-dependent kinase 2(Homo sapiens (Human))
De Montfort University
Curated by ChEMBL
LigandPNGBDBM50188066(CHEMBL213302 | N-(2-(1H-indol-3-yl)ethyl)-4-chloro...)
Affinity DataIC50:  7.31E+5nM. Assay description: Binding affinity to human CDK2/cyclinA using GST-pRB152 as substrate by chemiluminescence assay
In DepthDetails ArticlePubMed
TargetCyclin-dependent kinase/G2/mitotic-specific cyclin- 1(Homo sapiens (Human))
De Montfort University
Curated by ChEMBL
LigandPNGBDBM50188066(CHEMBL213302 | N-(2-(1H-indol-3-yl)ethyl)-4-chloro...)
Affinity DataIC50: >5.00E+5nM. Assay description: Binding affinity to human CDK1/cyclinB1
In DepthDetails ArticlePubMed
TargetCyclin-T1/Cyclin-dependent kinase 9(Homo sapiens (Human))
De Montfort University
Curated by ChEMBL
LigandPNGBDBM50188066(CHEMBL213302 | N-(2-(1H-indol-3-yl)ethyl)-4-chloro...)
Affinity DataIC50: >1.00E+6nM. Assay description: Binding affinity to human CDK9/cyclinT1
In DepthDetails ArticlePubMed
TargetCyclin-dependent kinase 4/G1/S-specific cyclin-D1(Homo sapiens (Human))
De Montfort University
Curated by ChEMBL
LigandPNGBDBM50188066(CHEMBL213302 | N-(2-(1H-indol-3-yl)ethyl)-4-chloro...)
Affinity DataIC50:  3.80E+4nM. Assay description: Binding affinity to human CDK4/cyclinD1 using GST-pRB152 as substrate by chemiluminescence assay
In DepthDetails ArticlePubMed