BDBM50188076 CHEMBL214188::N-(2-(1H-indol-3-yl)ethyl)-3-chloro-N-methylbenzamide
SMILES CN(CCc1c[nH]c2ccccc12)C(=O)c1cccc(Cl)c1
InChI Key InChIKey=XKYFQRXVLLTAEL-UHFFFAOYSA-N
Data  2 IC50
  Tab Delimited (TSV)   2D SDfile   Computed 3D by Vconf -m prep SDfile
Find this compound or compounds like it in BindingDB:
Activity Spreadsheet -- Enzyme Inhibition Constant Data from BindingDB
Found 2 hits for monomerid = 50188076
TargetCyclin-A1/Cyclin-A2/Cyclin-dependent kinase 2(Homo sapiens (Human))
De Montfort University
Curated by ChEMBL
LigandPNGBDBM50188076(CHEMBL214188 | N-(2-(1H-indol-3-yl)ethyl)-3-chloro...)
Affinity DataIC50:  1.12E+6nM. Assay description: Inhibition of Cdk2/Cyclin A
In DepthDetails ArticlePubMed
TargetCyclin-dependent kinase 4/G1/S-specific cyclin-D1(Homo sapiens (Human))
De Montfort University
Curated by ChEMBL
LigandPNGBDBM50188076(CHEMBL214188 | N-(2-(1H-indol-3-yl)ethyl)-3-chloro...)
Affinity DataIC50:  1.09E+5nM. Assay description: Inhibition of Cdk4/Cyclin D1
In DepthDetails ArticlePubMed