BDBM50188229 CHEMBL3827754
SMILES C(COCc1ccc2CCCCCc2c1)Cc1ccccc1
InChI Key InChIKey=SEBDVJHZNDFSMA-UHFFFAOYSA-N
Data  1 IC50
  Tab Delimited (TSV)   2D SDfile   Computed 3D by Vconf -m prep SDfile
Find this compound or compounds like it in BindingDB:
Activity Spreadsheet -- Enzyme Inhibition Constant Data from BindingDB
Found 1 hit for monomerid = 50188229
Target4,4'-diapophytoene desaturase (4,4'-diaponeurosporene-forming)(Staphylococcus aureus (strain Newman))
East China University Of Science And Technology
Curated by ChEMBL
LigandPNGBDBM50188229(CHEMBL3827754)
Affinity DataIC50: >2.00E+4nM. Assay description: Inhibition of diapophytoene desaturase in Staphylococcus aureus Newman assessed as reduction in staphyloxanthin pigment formation after 48 hrs by spe...
In DepthDetails ArticlePubMed