BDBM50188268 5-((4-methylpiperazin-1-yl)methyl)-3-phenyl-1,4-dihydroindeno[1,2-c]pyrazole::CHEMBL216020
SMILES CN1CCN(Cc2cccc-3c2Cc2c-3[nH]nc2-c2ccccc2)CC1
InChI Key InChIKey=XXYVZLIWJICVRO-UHFFFAOYSA-N
Data  1 IC50
  Tab Delimited (TSV)   2D SDfile   Computed 3D by Vconf -m prep SDfile
Find this compound or compounds like it in BindingDB:
Activity Spreadsheet -- Enzyme Inhibition Constant Data from BindingDB
Found 1 hit for monomerid = 50188268
TargetVascular endothelial growth factor receptor 2(Homo sapiens (Human))
Abbott Laboratories
Curated by ChEMBL
LigandPNGBDBM50188268(5-((4-methylpiperazin-1-yl)methyl)-3-phenyl-1,4-di...)
Affinity DataIC50:  1.41E+4nM. Assay description: Inhibition of VEGF-induced human KDR phosphorylation transfected in NIH3T3 cells by ELISA
In DepthDetails ArticlePubMed