BDBM50188730 CHEMBL213138::N-((5-(6-((4-methylpiperazin-1-yl)methyl)-1,4-dihydroindeno[1,2-c]pyrazol-3-yl)thiophen-2-yl)methyl)-2-m-tolylacetamide
SMILES CN1CCN(Cc2ccc-3c(Cc4c-3n[nH]c4-c3ccc(CNC(=O)Cc4cccc(C)c4)s3)c2)CC1
InChI Key InChIKey=YKTVFDSYOHZGCB-UHFFFAOYSA-N
Data  1 IC50
  Tab Delimited (TSV)   2D SDfile   Computed 3D by Vconf -m prep SDfile
Find this compound or compounds like it in BindingDB:
Activity Spreadsheet -- Enzyme Inhibition Constant Data from BindingDB
Found 1 hit for monomerid = 50188730
TargetVascular endothelial growth factor receptor 2(Homo sapiens (Human))
Abbott Laboratories
Curated by ChEMBL
LigandPNGBDBM50188730(CHEMBL213138 | N-((5-(6-((4-methylpiperazin-1-yl)m...)
Affinity DataIC50:  2.78E+3nM. Assay description: Inhibition of KDR at 1 mM ATP by HTRF assay
In DepthDetails ArticlePubMed