BDBM50188772 1-((4-(6-((4-methylpiperazin-1-yl)methyl)-1,4-dihydroindeno[1,2-c]pyrazol-3-yl)thiophen-2-yl)methyl)-3-m-tolylurea::CHEMBL215563
SMILES CN1CCN(Cc2ccc-3c(Cc4c-3n[nH]c4-c3csc(CNC(=O)Nc4cccc(C)c4)c3)c2)CC1
InChI Key InChIKey=XAUJPUSQPFKXTF-UHFFFAOYSA-N
Data  1 IC50
  Tab Delimited (TSV)   2D SDfile   Computed 3D by Vconf -m prep SDfile
Find this compound or compounds like it in BindingDB:
Activity Spreadsheet -- Enzyme Inhibition Constant Data from BindingDB
Found 1 hit for monomerid = 50188772
TargetVascular endothelial growth factor receptor 2(Homo sapiens (Human))
Abbott Laboratories
Curated by ChEMBL
LigandPNGBDBM50188772(1-((4-(6-((4-methylpiperazin-1-yl)methyl)-1,4-dihy...)
Affinity DataIC50:  180nM. Assay description: Inhibition of KDR at 1 mM ATP by HTRF assay
In DepthDetails ArticlePubMed