BDBM50188857 8-[1-(3-fluoro-phenyl)-cyclohexyl]-4-phenyl-2,8-diaza-spiro[4.5]decan-1-one::CHEMBL380244
SMILES Fc1cccc(c1)C1(CCCCC1)N1CCC2(CC1)C(CNC2=O)c1ccccc1
InChI Key InChIKey=CZFHRUYUXGGFNR-UHFFFAOYSA-N
Data  4 IC50  3 EC50
  Tab Delimited (TSV)   2D SDfile   Computed 3D by Vconf -m prep SDfile
Find this compound or compounds like it in BindingDB:
Activity Spreadsheet -- Enzyme Inhibition Constant Data from BindingDB
Found 7 hits for monomerid = 50188857
TargetSodium- and chloride-dependent glycine transporter 2(Homo sapiens (Human))
F. Hoffmann-La Roche
Curated by ChEMBL
LigandPNGBDBM50188857(8-[1-(3-fluoro-phenyl)-cyclohexyl]-4-phenyl-2,8-di...)
Affinity DataEC50: >3.00E+4nM. Assay description: Inhibition of [3H]glycine uptake at GlyT2
In DepthDetails ArticlePubMed
TargetNociceptin receptor(Homo sapiens (Human))
F. Hoffmann-La Roche
Curated by ChEMBL
LigandPNGBDBM50188857(8-[1-(3-fluoro-phenyl)-cyclohexyl]-4-phenyl-2,8-di...)
Affinity DataIC50: >1.00E+4nM. Assay description: Displacement of [3H]NOP from human NOP receptor expressed in HEK293 cells
In DepthDetails ArticlePubMed
TargetMu-type opioid receptor(Homo sapiens (Human))
F. Hoffmann-La Roche
Curated by ChEMBL
LigandPNGBDBM50188857(8-[1-(3-fluoro-phenyl)-cyclohexyl]-4-phenyl-2,8-di...)
Affinity DataIC50:  8.04E+3nM. Assay description: Displacement of [3H]naloxone from mu opioid receptor expressed in BHK cells
In DepthDetails ArticlePubMed
TargetNociceptin receptor(Homo sapiens (Human))
F. Hoffmann-La Roche
Curated by ChEMBL
LigandPNGBDBM50188857(8-[1-(3-fluoro-phenyl)-cyclohexyl]-4-phenyl-2,8-di...)
Affinity DataIC50: >1.00E+4nM. Assay description: Displacement of [3H]NOP from human NOP receptor expressed in HEK293 cells
In DepthDetails ArticlePubMed
TargetMu-type opioid receptor(Homo sapiens (Human))
F. Hoffmann-La Roche
Curated by ChEMBL
LigandPNGBDBM50188857(8-[1-(3-fluoro-phenyl)-cyclohexyl]-4-phenyl-2,8-di...)
Affinity DataIC50:  8.04E+3nM. Assay description: Displacement of [3H]naloxone from mu opioid receptor expressed in BHK cells
In DepthDetails ArticlePubMed
TargetSodium- and chloride-dependent glycine transporter 1(Homo sapiens (Human))
F. Hoffmann-La Roche
Curated by ChEMBL
LigandPNGBDBM50188857(8-[1-(3-fluoro-phenyl)-cyclohexyl]-4-phenyl-2,8-di...)
Affinity DataEC50:  423nM. Assay description: Inhibition of [3H]glycine uptake at GlyT1
In DepthDetails ArticlePubMed
TargetSodium- and chloride-dependent glycine transporter 1(Homo sapiens (Human))
F. Hoffmann-La Roche
Curated by ChEMBL
LigandPNGBDBM50188857(8-[1-(3-fluoro-phenyl)-cyclohexyl]-4-phenyl-2,8-di...)
Affinity DataEC50:  423nM. Assay description: Inhibition of [3H]glycine uptake at GlyT1
In DepthDetails ArticlePubMed