BDBM50188984 5-chloro-2-(3-mercaptophenyl)-3-(phenethylamino)indolizine-1-carbonitrile::CHEMBL379106
SMILES Sc1cccc(c1)-c1c(NCCc2ccccc2)n2c(Cl)cccc2c1C#N
InChI Key InChIKey=ZJRDICMMDHXJER-UHFFFAOYSA-N
Data  1 IC50
  Tab Delimited (TSV)   2D SDfile   Computed 3D by Vconf -m prep SDfile
Find this compound or compounds like it in BindingDB:
Activity Spreadsheet -- Enzyme Inhibition Constant Data from BindingDB
Found 1 hit for monomerid = 50188984
TargetNeuropilin-1(Homo sapiens (Human))
Pierre Fabre Urologie
Curated by ChEMBL
LigandPNGBDBM50188984(5-chloro-2-(3-mercaptophenyl)-3-(phenethylamino)in...)
Affinity DataIC50:  6.00E+3nM. Assay description: Inhibition of VEGF165-NRP1 interaction by ELISA
In DepthDetails ArticlePubMed