BDBM50189113 (4-benzyloxy-3-fluoro-phenyl)-{6-[5-(1-oxo-1lambda*4*-thiomorpholin-4-ylmethyl)-furan-2-yl]-quinazolin-4-yl}-amine::CHEMBL215716
SMILES Fc1cc(Nc2ncnc3ccc(cc23)-c2ccc(CN3CCS(=O)CC3)o2)ccc1OCc1ccccc1
InChI Key InChIKey=QLLLIGGXRUNRDR-UHFFFAOYSA-N
Data  2 IC50
  Tab Delimited (TSV)   2D SDfile   Computed 3D by Vconf -m prep SDfile
Find this compound or compounds like it in BindingDB:
Activity Spreadsheet -- Enzyme Inhibition Constant Data from BindingDB
Found 2 hits for monomerid = 50189113
TargetReceptor tyrosine-protein kinase erbB-2(Homo sapiens (Human))
Glaxosmithkline
Curated by ChEMBL
LigandPNGBDBM50189113((4-benzyloxy-3-fluoro-phenyl)-{6-[5-(1-oxo-1lambda...)
Affinity DataIC50:  35nM. Assay description: Inhibition of ErbB2
In DepthDetails ArticlePubMed
TargetEpidermal growth factor receptor(Homo sapiens (Human))
Glaxosmithkline
Curated by ChEMBL
LigandPNGBDBM50189113((4-benzyloxy-3-fluoro-phenyl)-{6-[5-(1-oxo-1lambda...)
Affinity DataIC50:  16nM. Assay description: Inhibition of ErbB1
In DepthDetails ArticlePubMed