BDBM50189116 CHEMBL213342::N-(4-(benzyloxy)phenyl)-6-(5-((2-(methylsulfonyl)ethylamino)methyl)furan-2-yl)quinazolin-4-amine
SMILES CS(=O)(=O)CCNCc1ccc(o1)-c1ccc2ncnc(Nc3ccc(OCc4ccccc4)cc3)c2c1
InChI Key InChIKey=PMNXVLOADVXDDY-UHFFFAOYSA-N
Data  2 IC50
  Tab Delimited (TSV)   2D SDfile   Computed 3D by Vconf -m prep SDfile
Find this compound or compounds like it in BindingDB:
Activity Spreadsheet -- Enzyme Inhibition Constant Data from BindingDB
Found 2 hits for monomerid = 50189116
TargetReceptor tyrosine-protein kinase erbB-2(Homo sapiens (Human))
Glaxosmithkline
Curated by ChEMBL
LigandPNGBDBM50189116(CHEMBL213342 | N-(4-(benzyloxy)phenyl)-6-(5-((2-(m...)
Affinity DataIC50:  26nM. Assay description: Inhibition of ErbB2
In DepthDetails ArticlePubMed
TargetEpidermal growth factor receptor(Homo sapiens (Human))
Glaxosmithkline
Curated by ChEMBL
LigandPNGBDBM50189116(CHEMBL213342 | N-(4-(benzyloxy)phenyl)-6-(5-((2-(m...)
Affinity DataIC50:  27nM. Assay description: Inhibition of ErbB1
In DepthDetails ArticlePubMed