BDBM50189305 CHEMBL3828410
SMILES NC(=N)c1ccc(NC(=O)C(=O)Nc2ccc(cc2)C(N)=N)cc1
InChI Key InChIKey=DOQCDEYHJCYWQO-UHFFFAOYSA-N
Data  5 KI
  Tab Delimited (TSV)   2D SDfile   Computed 3D by Vconf -m prep SDfile
Find this compound or compounds like it in BindingDB:
Activity Spreadsheet -- Enzyme Inhibition Constant Data from BindingDB
Found 5 hits for monomerid = 50189305
TargetSuppressor of tumorigenicity 14 protein(Homo sapiens (Human))
University Of Bonn
Curated by ChEMBL
LigandPNGBDBM50189305(CHEMBL3828410)
Affinity DataKi:  492nM. Assay description: Inhibition of human matriptase using Boc-Gln-Ala-Arg-AMC as substrate after 20 mins by fluorimetric analysis
In DepthDetails ArticlePubMed
TargetTrypsin(Homo sapiens (Human))
University Of Bonn
Curated by ChEMBL
LigandPNGBDBM50189305(CHEMBL3828410)
Affinity DataKi:  1.42E+3nM. Assay description: Inhibition of human trypsin using Boc-Gln-Ala-Arg-AMC as substrate after 20 mins by fluorimetric analysis
In DepthDetails ArticlePubMed
TargetTransmembrane protease serine 6(Homo sapiens (Human))
University Of Bonn
Curated by ChEMBL
LigandPNGBDBM50189305(CHEMBL3828410)
Affinity DataKi:  6.23E+3nM. Assay description: Inhibition of human matriptase-2 transfected in HEK cells using Boc-Gln-Ala-Arg-AMC as substrate after 20 mins by fluorimetric analysis
In DepthDetails ArticlePubMed
TargetProthrombin(Homo sapiens (Human))
University Of Bonn
Curated by ChEMBL
LigandPNGBDBM50189305(CHEMBL3828410)
Affinity DataKi:  1.58E+4nM. Assay description: Inhibition of human thrombin using Cbz-Gly-Gly-Arg-AMC as substrate after 20 mins by fluorimetric analysis
In DepthDetails ArticlePubMed
TargetCoagulation factor X(Bos taurus)
University Of Bonn
Curated by ChEMBL
LigandPNGBDBM50189305(CHEMBL3828410)
Affinity DataKi:  5.23E+4nM. Assay description: Inhibition of bovine factor 10a using Boc-Ile-Glu-Gly-Arg-AMC as substrate after 20 mins by fluorimetric analysis
In DepthDetails ArticlePubMed