BDBM50189321 CHEMBL3827044
SMILES CCCCCCCNC(=O)Oc1cccc(CN(C)CCCCCOc2ccc3Cc4cccnc4Oc3c2)c1
InChI Key InChIKey=XYGHSWJYJDPEQM-UHFFFAOYSA-N
Data  4 IC50
  Tab Delimited (TSV)   2D SDfile   Computed 3D by Vconf -m prep SDfile
Find this compound or compounds like it in BindingDB:
Activity Spreadsheet -- Enzyme Inhibition Constant Data from BindingDB
Found 4 hits for monomerid = 50189321
TargetAcetylcholinesterase(Homo sapiens (Human))
Alma Mater Studiorum-University Of Bologna
Curated by ChEMBL
LigandPNGBDBM50189321(CHEMBL3827044)
Affinity DataIC50:  6.90nM. Assay description: Inhibition of recombinant human AChE expressed in HEK293 cells using acetylthiocholine iodide as substrate preincubated for 120 mins followed by subs...
In DepthDetails ArticlePubMed
TargetFatty-acid amide hydrolase 1 [30-579](Rattus norvegicus (rat))
Alma Mater Studiorum-University Of Bologna
Curated by ChEMBL
LigandPNGBDBM50189321(CHEMBL3827044)
Affinity DataIC50:  178nM. Assay description: Inhibition of FAAH in rat brain membrane using N-arachidonoyl-[14C]-ethanolamine as substrate preincubated for 20 mins followed by substrate addition...
In DepthDetails ArticlePubMed
TargetFatty-acid amide hydrolase 1 [30-579](Rattus norvegicus (rat))
Alma Mater Studiorum-University Of Bologna
Curated by ChEMBL
LigandPNGBDBM50189321(CHEMBL3827044)
Affinity DataIC50:  2.18E+3nM. Assay description: Inhibition of FAAH in rat brain membrane using N-arachidonoyl-[14C]-ethanolamine as substrate incubated for 30 mins by scintillation counting method
In DepthDetails ArticlePubMed
TargetCholinesterase(Homo sapiens (Human))
Alma Mater Studiorum-University Of Bologna
Curated by ChEMBL
LigandPNGBDBM50189321(CHEMBL3827044)
Affinity DataIC50:  0.530nM. Assay description: Inhibition of human serum BuChE using butyrylthiocholine iodide as substrate preincubated for 20 mins followed by substrate addition by Ellman's meth...
In DepthDetails ArticlePubMed