BDBM50189331 CHEMBL3828259
SMILES CN(CCCOc1ccc2c(C)cc(=O)oc2c1)Cc1cccc(OC(=O)NCCCCCc2ccccc2)c1
InChI Key InChIKey=RIRAXUJPOGFDFJ-UHFFFAOYSA-N
Data  4 IC50
  Tab Delimited (TSV)   2D SDfile   Computed 3D by Vconf -m prep SDfile
Find this compound or compounds like it in BindingDB:
Activity Spreadsheet -- Enzyme Inhibition Constant Data from BindingDB
Found 4 hits for monomerid = 50189331
TargetCholinesterase(Homo sapiens (Human))
Alma Mater Studiorum-University Of Bologna
Curated by ChEMBL
LigandPNGBDBM50189331(CHEMBL3828259)
Affinity DataIC50:  2.80nM. Assay description: Inhibition of human serum BuChE using butyrylthiocholine iodide as substrate preincubated for 15 mins followed by substrate addition by Ellman's meth...
In DepthDetails ArticlePubMed
TargetFatty-acid amide hydrolase 1 [30-579](Rattus norvegicus (rat))
Alma Mater Studiorum-University Of Bologna
Curated by ChEMBL
LigandPNGBDBM50189331(CHEMBL3828259)
Affinity DataIC50:  135nM. Assay description: Inhibition of FAAH in rat brain membrane using N-arachidonoyl-[14C]-ethanolamine as substrate preincubated for 20 mins followed by substrate addition...
In DepthDetails ArticlePubMed
TargetFatty-acid amide hydrolase 1 [30-579](Rattus norvegicus (rat))
Alma Mater Studiorum-University Of Bologna
Curated by ChEMBL
LigandPNGBDBM50189331(CHEMBL3828259)
Affinity DataIC50:  459nM. Assay description: Inhibition of FAAH in rat brain membrane using N-arachidonoyl-[14C]-ethanolamine as substrate incubated for 30 mins by scintillation counting method
In DepthDetails ArticlePubMed
TargetAcetylcholinesterase(Homo sapiens (Human))
Alma Mater Studiorum-University Of Bologna
Curated by ChEMBL
LigandPNGBDBM50189331(CHEMBL3828259)
Affinity DataIC50:  81nM. Assay description: Inhibition of recombinant human AChE expressed in HEK293 cells using acetylthiocholine iodide as substrate preincubated for 120 mins followed by subs...
In DepthDetails ArticlePubMed