BDBM50189380 CHEMBL215372::N-(2-(4-benzylpiperidine-1-carbonyl)-1H-benzo[d]imidazol-5-yl)methanesulfonamide
SMILES CS(=O)(=O)Nc1ccc2nc([nH]c2c1)C(=O)N1CCC(Cc2ccccc2)CC1
InChI Key InChIKey=VLGZYFFHTHGXKK-UHFFFAOYSA-N
Data  1 IC50
  Tab Delimited (TSV)   2D SDfile   Computed 3D by Vconf -m prep SDfile
Find this compound or compounds like it in BindingDB:
Activity Spreadsheet -- Enzyme Inhibition Constant Data from BindingDB
Found 1 hit for monomerid = 50189380
TargetGlutamate receptor ionotropic, NMDA 2B(Rattus norvegicus (Rat))
Gedeon Richter
Curated by ChEMBL
LigandPNGBDBM50189380(CHEMBL215372 | N-(2-(4-benzylpiperidine-1-carbonyl...)
Affinity DataIC50:  3nM. Assay description: Displacement of [3H]Ro25-6981 from NR2B NMDA receptor in rat forebrain membrane
In DepthDetails ArticlePubMed