BDBM50189402 CHEMBL3828008
SMILES COc1ccccc1C(=O)Nc1cc2n(C)c(=O)n(C)c2cc1N1CCC[C@@H]1C
InChI Key InChIKey=JCCSEGJAEBNEDE-AWEZNQCLSA-N
Data  1 IC50
  Tab Delimited (TSV)   2D SDfile   Computed 3D by Vconf -m prep SDfile
Find this compound or compounds like it in BindingDB:
Activity Spreadsheet -- Enzyme Inhibition Constant Data from BindingDB
Found 1 hit for monomerid = 50189402
TargetPeregrin(Homo sapiens (Human))
Glaxosmithkline
Curated by ChEMBL
LigandPNGBDBM50189402(CHEMBL3828008)
Affinity DataIC50:  16nM. Assay description: Inhibition of synthetic fluorescent ligand binding to recombinant truncated 6H-Flag-TEV-BRPF1 (622 to 738 residues) (unknown origin) expressed in Esc...
In DepthDetails ArticlePubMed