BDBM50189469 4-hydroxy-2-oxo-3-phenyl-1,2-dihydroquinoline-6-carboxylic acid::CHEMBL209733
SMILES OC(=O)c1ccc2[nH]c(=O)c(-c3ccccc3)c(O)c2c1
InChI Key InChIKey=KWULBIHCCVKTRY-UHFFFAOYSA-N
Data  1 IC50
  Tab Delimited (TSV)   2D SDfile   Computed 3D by Vconf -m prep SDfile
Find this compound or compounds like it in BindingDB:
Activity Spreadsheet -- Enzyme Inhibition Constant Data from BindingDB
Found 1 hit for monomerid = 50189469
TargetFatty acid synthase(Rattus norvegicus)
Merck Research Laboratories
Curated by ChEMBL
LigandPNGBDBM50189469(4-hydroxy-2-oxo-3-phenyl-1,2-dihydroquinoline-6-ca...)
Affinity DataIC50: >1.50E+4nM. Assay description: Inhibition of rat FAS
In DepthDetails ArticlePubMed