BDBM50189489 7-chloro-4-hydroxy-3-(naphthalen-2-yl)-6-nitroquinolin-2(1H)-one::CHEMBL212823
SMILES Oc1c(-c2ccc3ccccc3c2)c(=O)[nH]c2cc(Cl)c(cc12)[N+]([O-])=O
InChI Key InChIKey=MWEPMKZTMUWAJN-UHFFFAOYSA-N
Data  1 IC50
  Tab Delimited (TSV)   2D SDfile   Computed 3D by Vconf -m prep SDfile
Find this compound or compounds like it in BindingDB:
Activity Spreadsheet -- Enzyme Inhibition Constant Data from BindingDB
Found 1 hit for monomerid = 50189489
TargetFatty acid synthase(Rattus norvegicus)
Merck Research Laboratories
Curated by ChEMBL
LigandPNGBDBM50189489(7-chloro-4-hydroxy-3-(naphthalen-2-yl)-6-nitroquin...)
Affinity DataIC50:  6.00E+3nM. Assay description: Inhibition of rat FAS
In DepthDetails ArticlePubMed