BDBM50189639 CHEMBL211061::biphenyl-4-sulfonic acid {1-(4-tert-butyl-1H-benzoimidazol-2-yl)-2-[4-(1,1,3-trioxo-1lambda*6*-isothiazolidin-5-yl)-phenyl]-ethyl}-amide
SMILES CC(C)(C)c1cccc2[nH]c(nc12)C(Cc1ccc(cc1)C1CC(=O)NS1(=O)=O)NS(=O)(=O)c1ccc(cc1)-c1ccccc1
InChI Key InChIKey=WFKUERJADOZONT-UHFFFAOYSA-N
Data  1 IC50
  Tab Delimited (TSV)   2D SDfile   Computed 3D by Vconf -m prep SDfile
Find this compound or compounds like it in BindingDB:
Activity Spreadsheet -- Enzyme Inhibition Constant Data from BindingDB
Found 1 hit for monomerid = 50189639
TargetTyrosine-protein phosphatase non-receptor type 1(Homo sapiens (Human))
Incyte
Curated by ChEMBL
LigandPNGBDBM50189639(CHEMBL211061 | biphenyl-4-sulfonic acid {1-(4-tert...)
Affinity DataIC50:  460nM. Assay description: Inhibition of PTP1B by pNPP assay
In DepthDetails ArticlePubMed