BDBM50189642 CHEMBL210836::N-(1S)-1-(1H-benzimidazol-2yl)-2-4-[(5S)-1,1-dioxo-3-oxoisothiazolidin-5-yl]phenylethyl)benzenesulfonamide
SMILES O=C1C[C@@H](c2ccc(C[C@H](NS(=O)(=O)c3ccccc3)c3nc4ccccc4[nH]3)cc2)S(=O)(=O)[N-]1
InChI Key InChIKey=RASDRJUDLUJJHJ-VXKWHMMOSA-M
Data  1 IC50
  Tab Delimited (TSV)   2D SDfile   Computed 3D by Vconf -m prep SDfile
Find this compound or compounds like it in BindingDB:
Activity Spreadsheet -- Enzyme Inhibition Constant Data from BindingDB
Found 1 hit for monomerid = 50189642
TargetTyrosine-protein phosphatase non-receptor type 1(Homo sapiens (Human))
Incyte
Curated by ChEMBL
LigandPNGBDBM50189642(CHEMBL210836 | N-(1S)-1-(1H-benzimidazol-2yl)-2-4-...)
Affinity DataIC50:  32nM. Assay description: Inhibition of PTP1B by pNPP assay
In DepthDetails ArticlePubMed