BDBM50189720 3-(N-benzyl-N-methylaminomethyl)-7-(2,6-difluorobenzyl)-4,7-dihydro-2-(4-(2-hydroxy-2-methylpropionylamido)phenyl)-5-isobutyryl-4-oxothieno[2,3-b]pyridine::CHEMBL212121
SMILES CC(C)C(=O)c1cn(Cc2c(F)cccc2F)c2sc(c(CN(C)Cc3ccccc3)c2c1=O)-c1ccc(NC(=O)C(C)(C)O)cc1
InChI Key InChIKey=XIKLJIKFVNUIBL-UHFFFAOYSA-N
Data  1 IC50
  Tab Delimited (TSV)   2D SDfile   Computed 3D by Vconf -m prep SDfile
Find this compound or compounds like it in BindingDB:
Activity Spreadsheet -- Enzyme Inhibition Constant Data from BindingDB
Found 1 hit for monomerid = 50189720
TargetGonadotropin-releasing hormone receptor(Homo sapiens (Human))
Takeda Pharmaceutical
Curated by ChEMBL
LigandPNGBDBM50189720(3-(N-benzyl-N-methylaminomethyl)-7-(2,6-difluorobe...)
Affinity DataIC50:  0.200nM. Assay description: Inhibition of [125I]leuprorelin binding to human recombinant LHRH receptor expressed in CHO cells
In DepthDetails ArticlePubMed