BDBM50189830 (2S)-4-methyl-2-((((2-methylphenyl)amino)thioxomethyl)-amino)-N-((3S)-tetrahydro-2-hydroxy-3-furanyl)pentanamide::CHEMBL209286
SMILES CC(C)C[C@H](NC(=S)Nc1ccccc1C)C(=O)N[C@H]1CCOC1O
InChI Key InChIKey=PPCPVLQVSOIYPO-GIIGEWEBSA-N
Data  2 IC50
  Tab Delimited (TSV)   2D SDfile   Computed 3D by Vconf -m prep SDfile
Find this compound or compounds like it in BindingDB:
Activity Spreadsheet -- Enzyme Inhibition Constant Data from BindingDB
Found 2 hits for monomerid = 50189830
TargetCalpain-2 catalytic subunit(Sus scrofa)
Senju Pharmaceutical
Curated by ChEMBL
LigandPNGBDBM50189830((2S)-4-methyl-2-((((2-methylphenyl)amino)thioxomet...)
Affinity DataIC50:  250nM. Assay description: Inhibition of porcein kidney m calpain
In DepthDetails ArticlePubMed
TargetCalpain-1 catalytic subunit(Homo sapiens (Human))
Senju Pharmaceutical
Curated by ChEMBL
LigandPNGBDBM50189830((2S)-4-methyl-2-((((2-methylphenyl)amino)thioxomet...)
Affinity DataIC50:  240nM. Assay description: Inhibition of human erythrocyte mu calpain
In DepthDetails ArticlePubMed