BDBM50189833 (S)-N-butyl-3-((S)-2-(4-fluorophenylsulfonamido)-3-methylbutanamido)-5-methyl-2-oxohexanamide::CHEMBL209457
SMILES CCCCNC(=O)C(=O)[C@H](CC(C)C)NC(=O)[C@@H](NS(=O)(=O)c1ccc(F)cc1)C(C)C
InChI Key InChIKey=LQVAVRLYUJNATG-OALUTQOASA-N
Data  2 IC50
  Tab Delimited (TSV)   2D SDfile   Computed 3D by Vconf -m prep SDfile
Find this compound or compounds like it in BindingDB:
Activity Spreadsheet -- Enzyme Inhibition Constant Data from BindingDB
Found 2 hits for monomerid = 50189833
TargetCalpain-1 catalytic subunit(Homo sapiens (Human))
Senju Pharmaceutical
Curated by ChEMBL
LigandPNGBDBM50189833((S)-N-butyl-3-((S)-2-(4-fluorophenylsulfonamido)-3...)
Affinity DataIC50:  21nM. Assay description: Inhibition of human erythrocyte mu calpain
In DepthDetails ArticlePubMed
TargetCalpain-2 catalytic subunit(Sus scrofa)
Senju Pharmaceutical
Curated by ChEMBL
LigandPNGBDBM50189833((S)-N-butyl-3-((S)-2-(4-fluorophenylsulfonamido)-3...)
Affinity DataIC50:  21nM. Assay description: Inhibition of porcein kidney m calpain
In DepthDetails ArticlePubMed