BDBM50189916 (R,S)-2-amino-4-(4-phosphono-butylsulfanyl)-butyric acid::CHEMBL209316
SMILES NC(CCSCCCCP(O)(O)=O)C(O)=O
InChI Key InChIKey=HXBDZSMUIRKCJX-UHFFFAOYSA-N
Data  1 IC50
  Tab Delimited (TSV)   2D SDfile   Computed 3D by Vconf -m prep SDfile
Find this compound or compounds like it in BindingDB:
Activity Spreadsheet -- Enzyme Inhibition Constant Data from BindingDB
Found 1 hit for monomerid = 50189916
TargetBetaine--homocysteine S-methyltransferase 1(Homo sapiens (Human))
Academy Of Sciences Of The Czech Republic
Curated by ChEMBL
LigandPNGBDBM50189916((R,S)-2-amino-4-(4-phosphono-butylsulfanyl)-butyri...)
Affinity DataIC50:  5.70E+3nM. Assay description: Inhibition of human BHMT
In DepthDetails ArticlePubMed