BDBM50189923 CHEMBL3828058::US10618914, Compound 1b::US11111253, Compound 1b
SMILES Clc1ccc(cc1Cl)C1=Nn2c(SC1)nnc2-c1cc(n[nH]1)-c1ccccc1
InChI Key InChIKey=CCKWMWIBTCPOKM-UHFFFAOYSA-N
Data  6 IC50
  Tab Delimited (TSV)   2D SDfile   Computed 3D by Vconf -m prep SDfile
Find this compound or compounds like it in BindingDB:
Activity Spreadsheet -- Enzyme Inhibition Constant Data from BindingDB
Found 6 hits for monomerid = 50189923
TargetSignal transducer and activator of transcription 3(Homo sapiens (Human))
University Of Pittsburgh
Curated by ChEMBL
LigandPNGBDBM50189923(CHEMBL3828058 | US10618914, Compound 1b | US111112...)
Affinity DataIC50:  3.12E+4nM. Assay description: Inhibition of IL6-induced STAT3 in human CAL33 cells
In DepthDetails ArticlePubMed
TargetSignal transducer and activator of transcription 1-alpha/beta(Homo sapiens (Human))
University Of Pittsburgh
Curated by ChEMBL
LigandPNGBDBM50189923(CHEMBL3828058 | US10618914, Compound 1b | US111112...)
Affinity DataIC50: >5.00E+4nM. Assay description: Inhibition of IFNgamma-induced STAT1 (unknown origin)
In DepthDetails ArticlePubMed
TargetSignal transducer and activator of transcription 1-alpha/beta(Homo sapiens (Human))
University Of Pittsburgh
Curated by ChEMBL
LigandPNGBDBM50189923(CHEMBL3828058 | US10618914, Compound 1b | US111112...)
Affinity DataIC50: >5.00E+4nM. Assay description: Compound samples (in 3-5 mg quantities) were evaluated in a variety of assays. All compound submissions were fully characterized (1H, 13C, IR, FIRMS)...
In DepthDetails US Patent
TargetSignal transducer and activator of transcription 1-alpha/beta(Homo sapiens (Human))
University Of Pittsburgh
Curated by ChEMBL
LigandPNGBDBM50189923(CHEMBL3828058 | US10618914, Compound 1b | US111112...)
Affinity DataIC50: >5.00E+4nM. Assay description: Compound samples (in 3-5 mg quantities) were evaluated in a variety of assays. All compound submissions were fully characterized (1H, 13C, IR, HRMS),...
In DepthDetails US Patent
TargetSignal transducer and activator of transcription 3(Homo sapiens (Human))
University Of Pittsburgh
Curated by ChEMBL
LigandPNGBDBM50189923(CHEMBL3828058 | US10618914, Compound 1b | US111112...)
Affinity DataIC50:  3.12E+4nM. Assay description: Compound samples (in 3-5 mg quantities) were evaluated in a variety of assays. All compound submissions were fully characterized (1H, 13C, IR, FIRMS)...
In DepthDetails US Patent
TargetSignal transducer and activator of transcription 3(Homo sapiens (Human))
University Of Pittsburgh
Curated by ChEMBL
LigandPNGBDBM50189923(CHEMBL3828058 | US10618914, Compound 1b | US111112...)
Affinity DataIC50:  6.80E+3nM. Assay description: Compound samples (in 3-5 mg quantities) were evaluated in a variety of assays. All compound submissions were fully characterized (1H, 13C, IR, HRMS),...
In DepthDetails US Patent