BDBM50189929 CHEMBL3827328::US10618914, Compound 8a::US11111253, Compound 8a
SMILES COc1ccc(cc1)C1=Nn2c(SC1)nnc2-c1[nH]nc2CCCc12
InChI Key InChIKey=UEVMXEZUMHYJAY-UHFFFAOYSA-N
Data  8 IC50
  Tab Delimited (TSV)   2D SDfile   Computed 3D by Vconf -m prep SDfile
Find this compound or compounds like it in BindingDB:
Activity Spreadsheet -- Enzyme Inhibition Constant Data from BindingDB
Found 8 hits for monomerid = 50189929
TargetSignal transducer and activator of transcription 3(Homo sapiens (Human))
University Of Pittsburgh
Curated by ChEMBL
LigandPNGBDBM50189929(CHEMBL3827328 | US10618914, Compound 8a | US111112...)
Affinity DataIC50:  1.79E+4nM. Assay description: Inhibition of IL6-induced STAT3 in human CAL33 cells
In DepthDetails ArticlePubMed
TargetSignal transducer and activator of transcription 1-alpha/beta(Homo sapiens (Human))
University Of Pittsburgh
Curated by ChEMBL
LigandPNGBDBM50189929(CHEMBL3827328 | US10618914, Compound 8a | US111112...)
Affinity DataIC50:  4.06E+4nM. Assay description: Inhibition of IFNgamma-induced STAT1 (unknown origin)
In DepthDetails ArticlePubMed
TargetSignal transducer and activator of transcription 3(Homo sapiens (Human))
University Of Pittsburgh
Curated by ChEMBL
LigandPNGBDBM50189929(CHEMBL3827328 | US10618914, Compound 8a | US111112...)
Affinity DataIC50:  3.59E+4nM. Assay description: Compound samples (in 3-5 mg quantities) were evaluated in a variety of assays. All compound submissions were fully characterized (1H, 13C, IR, HRMS),...
In DepthDetails US Patent
TargetSignal transducer and activator of transcription 1-alpha/beta(Homo sapiens (Human))
University Of Pittsburgh
Curated by ChEMBL
LigandPNGBDBM50189929(CHEMBL3827328 | US10618914, Compound 8a | US111112...)
Affinity DataIC50:  4.06E+4nM. Assay description: Compound samples (in 3-5 mg quantities) were evaluated in a variety of assays. All compound submissions were fully characterized (1H, 13C, IR, FIRMS)...
In DepthDetails US Patent
TargetSignal transducer and activator of transcription 1-alpha/beta(Homo sapiens (Human))
University Of Pittsburgh
Curated by ChEMBL
LigandPNGBDBM50189929(CHEMBL3827328 | US10618914, Compound 8a | US111112...)
Affinity DataIC50:  4.06E+4nM. Assay description: Compound samples (in 3-5 mg quantities) were evaluated in a variety of assays. All compound submissions were fully characterized (1H, 13C, IR, HRMS),...
In DepthDetails US Patent
TargetSignal transducer and activator of transcription 3(Homo sapiens (Human))
University Of Pittsburgh
Curated by ChEMBL
LigandPNGBDBM50189929(CHEMBL3827328 | US10618914, Compound 8a | US111112...)
Affinity DataIC50:  3.59E+4nM. Assay description: Compound samples (in 3-5 mg quantities) were evaluated in a variety of assays. All compound submissions were fully characterized (1H, 13C, IR, FIRMS)...
In DepthDetails US Patent
TargetSignal transducer and activator of transcription 3(Homo sapiens (Human))
University Of Pittsburgh
Curated by ChEMBL
LigandPNGBDBM50189929(CHEMBL3827328 | US10618914, Compound 8a | US111112...)
Affinity DataIC50:  1.79E+4nM. Assay description: Compound samples (in 3-5 mg quantities) were evaluated in a variety of assays. All compound submissions were fully characterized (1H, 13C, IR, FIRMS)...
In DepthDetails US Patent
TargetSignal transducer and activator of transcription 3(Homo sapiens (Human))
University Of Pittsburgh
Curated by ChEMBL
LigandPNGBDBM50189929(CHEMBL3827328 | US10618914, Compound 8a | US111112...)
Affinity DataIC50:  1.79E+4nM. Assay description: Compound samples (in 3-5 mg quantities) were evaluated in a variety of assays. All compound submissions were fully characterized (1H, 13C, IR, HRMS),...
In DepthDetails US Patent