BDBM50189972 CHEMBL3828048::US10618914, Compound 21::US11111253, Compound 21
SMILES CC1Sc2nnc(-c3cc(n[nH]3)-c3ccccc3)n2N=C1c1ccccc1
InChI Key InChIKey=OMXOROAIBLTXLR-UHFFFAOYSA-N
Data  7 IC50
  Tab Delimited (TSV)   2D SDfile   Computed 3D by Vconf -m prep SDfile
Find this compound or compounds like it in BindingDB:
Activity Spreadsheet -- Enzyme Inhibition Constant Data from BindingDB
Found 7 hits for monomerid = 50189972
TargetSignal transducer and activator of transcription 3(Homo sapiens (Human))
University Of Pittsburgh
Curated by ChEMBL
LigandPNGBDBM50189972(CHEMBL3828048 | US10618914, Compound 21 | US111112...)
Affinity DataIC50:  3.40E+3nM. Assay description: Inhibition of IL6-induced STAT3 in human CAL33 cells
In DepthDetails ArticlePubMed
TargetSignal transducer and activator of transcription 1-alpha/beta(Homo sapiens (Human))
University Of Pittsburgh
Curated by ChEMBL
LigandPNGBDBM50189972(CHEMBL3828048 | US10618914, Compound 21 | US111112...)
Affinity DataIC50:  1.50E+4nM. Assay description: Inhibition of IFNgamma-induced STAT1 (unknown origin)
In DepthDetails ArticlePubMed
TargetSignal transducer and activator of transcription 3(Homo sapiens (Human))
University Of Pittsburgh
Curated by ChEMBL
LigandPNGBDBM50189972(CHEMBL3828048 | US10618914, Compound 21 | US111112...)
Affinity DataIC50:  3.40E+3nM. Assay description: Compound samples (in 3-5 mg quantities) were evaluated in a variety of assays. All compound submissions were fully characterized (1H, 13C, IR, HRMS),...
In DepthDetails US Patent
TargetSignal transducer and activator of transcription 1-alpha/beta(Homo sapiens (Human))
University Of Pittsburgh
Curated by ChEMBL
LigandPNGBDBM50189972(CHEMBL3828048 | US10618914, Compound 21 | US111112...)
Affinity DataIC50:  1.50E+4nM. Assay description: Compound samples (in 3-5 mg quantities) were evaluated in a variety of assays. All compound submissions were fully characterized (1H, 13C, IR, FIRMS)...
In DepthDetails US Patent
TargetSignal transducer and activator of transcription 3(Homo sapiens (Human))
University Of Pittsburgh
Curated by ChEMBL
LigandPNGBDBM50189972(CHEMBL3828048 | US10618914, Compound 21 | US111112...)
Affinity DataIC50:  3.00E+3nM. Assay description: Compound samples (in 3-5 mg quantities) were evaluated in a variety of assays. All compound submissions were fully characterized (1H, 13C, IR, FIRMS)...
In DepthDetails US Patent
TargetSignal transducer and activator of transcription 3(Homo sapiens (Human))
University Of Pittsburgh
Curated by ChEMBL
LigandPNGBDBM50189972(CHEMBL3828048 | US10618914, Compound 21 | US111112...)
Affinity DataIC50:  3.40E+3nM. Assay description: Compound samples (in 3-5 mg quantities) were evaluated in a variety of assays. All compound submissions were fully characterized (1H, 13C, IR, FIRMS)...
In DepthDetails US Patent
TargetSignal transducer and activator of transcription 1-alpha/beta(Homo sapiens (Human))
University Of Pittsburgh
Curated by ChEMBL
LigandPNGBDBM50189972(CHEMBL3828048 | US10618914, Compound 21 | US111112...)
Affinity DataIC50:  1.50E+4nM. Assay description: Compound samples (in 3-5 mg quantities) were evaluated in a variety of assays. All compound submissions were fully characterized (1H, 13C, IR, HRMS),...
In DepthDetails US Patent