BDBM50190105 CHEMBL3827269::US10618914, Compound 31
SMILES COCCC1Sc2nnc(-c3cc(n[nH]3)-c3ccccc3)n2N=C1c1ccc(OC)cc1
InChI Key InChIKey=PVUJVPZHECDFFI-UHFFFAOYSA-N
Data  2 IC50
  Tab Delimited (TSV)   2D SDfile   Computed 3D by Vconf -m prep SDfile
Find this compound or compounds like it in BindingDB:
Activity Spreadsheet -- Enzyme Inhibition Constant Data from BindingDB
Found 2 hits for monomerid = 50190105
TargetSignal transducer and activator of transcription 3(Homo sapiens (Human))
University Of Pittsburgh
US Patent
LigandPNGBDBM50190105(CHEMBL3827269 | US10618914, Compound 31)
Affinity DataIC50: >5.00E+4nM. Assay description: Compound samples (in 3-5 mg quantities) were evaluated in a variety of assays. All compound submissions were fully characterized (1H, 13C, IR, HRMS),...
In DepthDetails US Patent
TargetSignal transducer and activator of transcription 3(Homo sapiens (Human))
University Of Pittsburgh
US Patent
LigandPNGBDBM50190105(CHEMBL3827269 | US10618914, Compound 31)
Affinity DataIC50: >5.00E+4nM. Assay description: Inhibition of IL6-induced STAT3 in human CAL33 cells
In DepthDetails ArticlePubMed