BDBM50190177 CHEMBL3828609
SMILES Cc1nc2ccccc2n1CC(=O)NNC(=O)Cc1ccccc1
InChI Key InChIKey=PQEIJBAFFMEGPU-UHFFFAOYSA-N
Data  1 IC50
  Tab Delimited (TSV)   2D SDfile   Computed 3D by Vconf -m prep SDfile
Find this compound or compounds like it in BindingDB:
Activity Spreadsheet -- Enzyme Inhibition Constant Data from BindingDB
Found 1 hit for monomerid = 50190177
TargetGlycogen synthase kinase-3 beta(Homo sapiens (Human))
Jamia Hamdard (Hamdard University)
Curated by ChEMBL
LigandPNGBDBM50190177(CHEMBL3828609)
Affinity DataIC50:  105nM. Assay description: Inhibition of recombinant human N-terminal His-tagged GSK-3beta expressed in Escherichia coli using glycogen synthase-2 as substrate and ATP measured...
In DepthDetails ArticlePubMed