BDBM50190329 CHEMBL3827065
SMILES CCc1ccc(cc1)N1C(=O)\C(=C\c2cccc(O)c2O)N(C)C1=S
InChI Key InChIKey=MGHDQIPRNJXVBF-PTNGSMBKSA-N
Data  2 KI
  Tab Delimited (TSV)   2D SDfile   Computed 3D by Vconf -m prep SDfile
Find this compound or compounds like it in BindingDB:
Activity Spreadsheet -- Enzyme Inhibition Constant Data from BindingDB
Found 2 hits for monomerid = 50190329
TargetNADPH oxidase 4(Homo sapiens (Human))
Ewha Womans University
Curated by ChEMBL
LigandPNGBDBM50190329(CHEMBL3827065)
Affinity DataKi:  2.64E+4nM. Assay description: Inhibition of human NOX4 expressed in Drosophila DUOX knockdown model assessed as decrease in ROS production by lucigenin chemiluminescence assay
In DepthDetails ArticlePubMed
TargetNADPH oxidase 1(Homo sapiens (Human))
Ewha Womans University
Curated by ChEMBL
LigandPNGBDBM50190329(CHEMBL3827065)
Affinity DataKi:  2.79E+4nM. Assay description: Inhibition of human NOX1 expressed in Drosophila DUOX knockdown model assessed as decrease in ROS production by lucigenin chemiluminescence assay
In DepthDetails ArticlePubMed