BDBM50190407 (3S)-3-methylpentan-3-yl 3-(5-(1,1,1,3,3,3-hexafluoro-2-hydroxypropan-2-yl)-4,5-dihydroisoxazole-3-carboxamido)butanoate::CHEMBL209844
SMILES CCC(C)(CC)OC(=O)C[C@H](C)NC(=O)C1=NOC(C1)C(O)(C(F)(F)F)C(F)(F)F
InChI Key InChIKey=BMCZMRJCAQTCOR-FTNKSUMCSA-N
Data  1 IC50
  Tab Delimited (TSV)   2D SDfile   Computed 3D by Vconf -m prep SDfile
Find this compound or compounds like it in BindingDB:
Activity Spreadsheet -- Enzyme Inhibition Constant Data from BindingDB
Found 1 hit for monomerid = 50190407
TargetMalonyl-CoA decarboxylase, mitochondrial(Homo sapiens (Human))
Chugai Pharma Usa
Curated by ChEMBL
LigandPNGBDBM50190407((3S)-3-methylpentan-3-yl 3-(5-(1,1,1,3,3,3-hexaflu...)
Affinity DataIC50:  5nM. Assay description: Inhibition of malonyl-coenzyme A decarboxylase
In DepthDetails ArticlePubMed