BDBM50190490 CHEMBL212534::N-(3,5-diamino-6-chloropyrazine-2-carbony)-N'-{4-[3-(2,3-dihydroxypropoxy)-phenyl]butyl}guanidine
SMILES NC(NC(=O)c1nc(Cl)c(N)nc1N)=NCCCCc1cccc(OCC(O)CO)c1
InChI Key InChIKey=LUFPNYOJTZPYML-UHFFFAOYSA-N
Data  1 IC50
  Tab Delimited (TSV)   2D SDfile   Computed 3D by Vconf -m prep SDfile
Find this compound or compounds like it in BindingDB:
Activity Spreadsheet -- Enzyme Inhibition Constant Data from BindingDB
Found 1 hit for monomerid = 50190490
TargetAmiloride-sensitive sodium channel subunit alpha(Homo sapiens (Human))
Parion Sciences
Curated by ChEMBL
LigandPNGBDBM50190490(CHEMBL212534 | N-(3,5-diamino-6-chloropyrazine-2-c...)
Affinity DataIC50:  26nM. Assay description: Inhibition of dog bronchi prototypical epithelial sodium channel by electrophysiological assay
In DepthDetails ArticlePubMed