BDBM50190700 8-[4-(2-hydroxyethylamidosulfonyl)phenyl]-1,3-dimethylxanthine::CHEMBL377106
SMILES Cn1c2nc([nH]c2c(=O)n(C)c1=O)-c1ccc(cc1)S(=O)(=O)NCCO
InChI Key InChIKey=VNXFJFCNDLPYDS-UHFFFAOYSA-N
Data  3 KI
  Tab Delimited (TSV)   2D SDfile   Computed 3D by Vconf -m prep SDfile
Find this compound or compounds like it in BindingDB:
Activity Spreadsheet -- Enzyme Inhibition Constant Data from BindingDB
Found 3 hits for monomerid = 50190700
TargetAdenosine receptor A1(Rattus norvegicus (rat))
University Of Bonn
Curated by ChEMBL
LigandPNGBDBM50190700(8-[4-(2-hydroxyethylamidosulfonyl)phenyl]-1,3-dime...)
Affinity DataKi:  98nM. Assay description: Displacement of [3H]CCPA from adenosine A1 receptor in rat brain cortical membranes
In DepthDetails ArticlePubMed
TargetAdenosine receptor A2b(Homo sapiens (Human))
University Of Bonn
Curated by ChEMBL
LigandPNGBDBM50190700(8-[4-(2-hydroxyethylamidosulfonyl)phenyl]-1,3-dime...)
Affinity DataKi:  250nM. Assay description: Displacement of [3H]PSB298 from human recombinant adenosine A2B receptor expressed in CHO cells
In DepthDetails ArticlePubMed
TargetAdenosine receptor A2a(Rattus norvegicus (rat))
University Of Bonn
Curated by ChEMBL
LigandPNGBDBM50190700(8-[4-(2-hydroxyethylamidosulfonyl)phenyl]-1,3-dime...)
Affinity DataKi:  347nM. Assay description: Displacement of [3H]MSX2 from adenosine A2A receptor in rat brain striatal membranes
In DepthDetails ArticlePubMed