BDBM50190702 8-[4-(phenylethylamidosulfonyl)phenyl]-1-propylxanthine::CHEMBL211521
SMILES CCCn1c(=O)[nH]c2nc([nH]c2c1=O)-c1ccc(cc1)S(=O)(=O)NCCc1ccccc1
InChI Key InChIKey=UZYVMMMONZXOCT-UHFFFAOYSA-N
Data  5 KI
  Tab Delimited (TSV)   2D SDfile   Computed 3D by Vconf -m prep SDfile
Find this compound or compounds like it in BindingDB:
Activity Spreadsheet -- Enzyme Inhibition Constant Data from BindingDB
Found 5 hits for monomerid = 50190702
TargetAdenosine receptor A2b(Homo sapiens (Human))
University Of Bonn
Curated by ChEMBL
LigandPNGBDBM50190702(8-[4-(phenylethylamidosulfonyl)phenyl]-1-propylxan...)
Affinity DataKi:  3.62nM. Assay description: Displacement of [3H]PSB298 from human recombinant adenosine A2B receptor expressed in CHO cells
In DepthDetails ArticlePubMed
TargetAdenosine receptor A1(Rattus norvegicus (rat))
University Of Bonn
Curated by ChEMBL
LigandPNGBDBM50190702(8-[4-(phenylethylamidosulfonyl)phenyl]-1-propylxan...)
Affinity DataKi:  10nM. Assay description: Displacement of [3H]CCPA from adenosine A1 receptor in rat brain cortical membranes
In DepthDetails ArticlePubMed
TargetAdenosine receptor A1(Homo sapiens (Human))
University Of Bonn
Curated by ChEMBL
LigandPNGBDBM50190702(8-[4-(phenylethylamidosulfonyl)phenyl]-1-propylxan...)
Affinity DataKi:  183nM. Assay description: Displacement of [3H]CCPA from human recombinant adenosine A1 receptor expressed in CHO cells
In DepthDetails ArticlePubMed
TargetAdenosine receptor A2a(Rattus norvegicus (rat))
University Of Bonn
Curated by ChEMBL
LigandPNGBDBM50190702(8-[4-(phenylethylamidosulfonyl)phenyl]-1-propylxan...)
Affinity DataKi:  297nM. Assay description: Displacement of [3H]MSX2 from adenosine A2A receptor in rat brain striatal membranes
In DepthDetails ArticlePubMed
TargetAdenosine receptor A2a(Homo sapiens (Human))
University Of Bonn
Curated by ChEMBL
LigandPNGBDBM50190702(8-[4-(phenylethylamidosulfonyl)phenyl]-1-propylxan...)
Affinity DataKi:  769nM. Assay description: Displacement of [3H]MSX2 from human recombinant adenosine A2A receptor expressed in CHO cells
In DepthDetails ArticlePubMed