BDBM50191309 CHEMBL3919384
SMILES CC(C)C[C@H](NC(=O)[C@H](CCCNC(N)=N)NC(=O)[C@H](CCC(O)=O)NC(=O)[C@H](Cc1ccccc1)NC(=O)[C@@H](N)CCCCN)C(=O)N[C@@H](CCC(N)=O)C(=O)N[C@@H]([C@@H](C)O)C(O)=O
InChI Key InChIKey=ATYMWGDBICEEAV-FIMGNQKVSA-N
Data  1 IC50
  Tab Delimited (TSV)   2D SDfile   Computed 3D by Vconf -m prep SDfile
Find this compound or compounds like it in BindingDB:
Activity Spreadsheet -- Enzyme Inhibition Constant Data from BindingDB
Found 1 hit for monomerid = 50191309
TargetBeta-adrenergic receptor kinase 1(Bos taurus)
Universit£
Curated by ChEMBL
LigandPNGBDBM50191309(CHEMBL3919384)
Affinity DataIC50:  2.60E+6nM. Assay description: Inhibition of bovine cerebral cortex GRK2 assessed as decrease in phosphorylation of beta-adrenoceptor in presence of [gamma-32P]-ATP by SDS-PAGE ana...
In DepthDetails ArticlePubMed