BDBM50191791 1-(4-fluorophenethyl)-1H-imidazole::CHEMBL215425
SMILES Fc1ccc(CCn2ccnc2)cc1
InChI Key InChIKey=YNSQEQIKOLIXES-UHFFFAOYSA-N
Data  1 IC50
  Tab Delimited (TSV)   2D SDfile   Computed 3D by Vconf -m prep SDfile
Find this compound or compounds like it in BindingDB:
Activity Spreadsheet -- Enzyme Inhibition Constant Data from BindingDB
Found 1 hit for monomerid = 50191791
TargetSteroid 17-alpha-hydroxylase/17,20 lyase(Rattus norvegicus (Rat))
Kingston University
Curated by ChEMBL
LigandPNGBDBM50191791(1-(4-fluorophenethyl)-1H-imidazole | CHEMBL215425)
Affinity DataIC50:  1.20E+5nM. Assay description: Inhibition of rat testis 17alpha-hydroxylase component of P450-17alpha
In DepthDetails ArticlePubMed