BDBM50191970 3-biphenyl-4-yl-4-cyano-1,5-dimethyl-1H-pyrrole-2-carboxylic acid::CHEMBL215272
SMILES Cc1c(C#N)c(c(C(O)=O)n1C)-c1ccc(cc1)-c1ccccc1
InChI Key InChIKey=WFIIIBVCKSRDRH-UHFFFAOYSA-N
Data  4 EC50
  Tab Delimited (TSV)   2D SDfile   Computed 3D by Vconf -m prep SDfile
Find this compound or compounds like it in BindingDB:
Activity Spreadsheet -- Enzyme Inhibition Constant Data from BindingDB
Found 4 hits for monomerid = 50191970
TargetGlutamate receptor 4(Homo sapiens (Human))
Eli Lilly
Curated by ChEMBL
LigandPNGBDBM50191970(3-biphenyl-4-yl-4-cyano-1,5-dimethyl-1H-pyrrole-2-...)
Affinity DataEC50:  532nM. Assay description: Activity at human recombinant iGluR4 flip expressed in HEK293 cells measured as change in intracellular calcium ion concentration in presence of glut...
In DepthDetails ArticlePubMed
TargetGlutamate receptor 4(Homo sapiens (Human))
Eli Lilly
Curated by ChEMBL
LigandPNGBDBM50191970(3-biphenyl-4-yl-4-cyano-1,5-dimethyl-1H-pyrrole-2-...)
Affinity DataEC50:  2.39E+3nM. Assay description: Activity at human recombinant iGluR4 flop expressed in HEK293 cells measured as change in intracellular calcium ion concentration in presence of glut...
In DepthDetails ArticlePubMed
TargetGlutamate receptor 2(Homo sapiens (Human))
Eli Lilly
Curated by ChEMBL
LigandPNGBDBM50191970(3-biphenyl-4-yl-4-cyano-1,5-dimethyl-1H-pyrrole-2-...)
Affinity DataEC50:  308nM. Assay description: Activity at human recombinant iGluR2 flip expressed in HEK293 cells measured as change in intracellular calcium ion concentration in presence of glut...
In DepthDetails ArticlePubMed
TargetGlutamate receptor 2(Homo sapiens (Human))
Eli Lilly
Curated by ChEMBL
LigandPNGBDBM50191970(3-biphenyl-4-yl-4-cyano-1,5-dimethyl-1H-pyrrole-2-...)
Affinity DataEC50:  391nM. Assay description: Activity at human recombinant iGluR2 flop expressed in HEK293 cells measured as change in intracellular calcium ion concentration in presence of glut...
In DepthDetails ArticlePubMed