BDBM50192216 3-(4-tert-butylphenyl)-4-cyano-5-ethylthiophene-2-carboxylic acid::CHEMBL214833
SMILES CCc1sc(C(O)=O)c(c1C#N)-c1ccc(cc1)C(C)(C)C
InChI Key InChIKey=PTRJVLCUGFRMIG-UHFFFAOYSA-N
Data  4 EC50
  Tab Delimited (TSV)   2D SDfile   Computed 3D by Vconf -m prep SDfile
Find this compound or compounds like it in BindingDB:
Activity Spreadsheet -- Enzyme Inhibition Constant Data from BindingDB
Found 4 hits for monomerid = 50192216
TargetGlutamate receptor 2(Homo sapiens (Human))
Eli Lilly
Curated by ChEMBL
LigandPNGBDBM50192216(3-(4-tert-butylphenyl)-4-cyano-5-ethylthiophene-2-...)
Affinity DataEC50:  216nM. Assay description: Activity against human GLUR2 flop expressed in HEK293 cells assesed as glutamate-stimulated calcium influx by FLIPR assay
In DepthDetails ArticlePubMed
TargetGlutamate receptor 4(Homo sapiens (Human))
Eli Lilly
Curated by ChEMBL
LigandPNGBDBM50192216(3-(4-tert-butylphenyl)-4-cyano-5-ethylthiophene-2-...)
Affinity DataEC50:  1.22E+3nM. Assay description: Activity against human GLUR4 flop expressed in HEK293 cells assesed as glutamate-stimulated calcium influx by FLIPR assay
In DepthDetails ArticlePubMed
TargetGlutamate receptor 2(Homo sapiens (Human))
Eli Lilly
Curated by ChEMBL
LigandPNGBDBM50192216(3-(4-tert-butylphenyl)-4-cyano-5-ethylthiophene-2-...)
Affinity DataEC50:  47nM. Assay description: Activity against human GLUR2 flip expressed in HEK293 cells assesed as glutamate-stimulated calcium influx by FLIPR assay
In DepthDetails ArticlePubMed
TargetGlutamate receptor 4(Homo sapiens (Human))
Eli Lilly
Curated by ChEMBL
LigandPNGBDBM50192216(3-(4-tert-butylphenyl)-4-cyano-5-ethylthiophene-2-...)
Affinity DataEC50:  183nM. Assay description: Activity against human GLUR4 flip expressed in HEK293 cells assesed as glutamate-stimulated calcium influx by FLIPR assay
In DepthDetails ArticlePubMed