BDBM50192322 CHEMBL3947961
SMILES Cn1c(SCCCN2CC[C@]3(C[C@H]3c3ccc(cc3)C(F)(F)F)C2)nnc1-c1ccncc1
InChI Key InChIKey=DWDIQEPGVYBABO-REWPJTCUSA-N
Data  2 KI  1 IC50
  Tab Delimited (TSV)   2D SDfile   Computed 3D by Vconf -m prep SDfile
Find this compound or compounds like it in BindingDB:
Activity Spreadsheet -- Enzyme Inhibition Constant Data from BindingDB
Found 3 hits for monomerid = 50192322
TargetD(3) dopamine receptor(Homo sapiens (Human))
Aptuit
Curated by ChEMBL
LigandPNGBDBM50192322(CHEMBL3947961)
Affinity DataKi:  7.90nM. Assay description: Displacement of [3H]-spiperone from human dopamine D3 receptor expressed in CHO-K1 cell membranes after 90 mins by liquid scintillation counting
In DepthDetails ArticlePubMed
TargetD(2) dopamine receptor(Homo sapiens (Human))
Aptuit
Curated by ChEMBL
LigandPNGBDBM50192322(CHEMBL3947961)
Affinity DataKi:  871nM. Assay description: Displacement of [3H]-spiperone from human dopamine D2 receptor expressed in CHO-K1 cell membranes coexpressing Galpha16 after 120 mins by liquid scin...
In DepthDetails ArticlePubMed
TargetPotassium voltage-gated channel subfamily H member 2(Homo sapiens (Human))
Aptuit
Curated by ChEMBL
LigandPNGBDBM50192322(CHEMBL3947961)
Affinity DataIC50:  224nM. Assay description: Inhibition of human ERG transfected in HEK293 cells assessed as reduction in tail current by patch clamp assay
In DepthDetails ArticlePubMed