BDBM50192332 CHEMBL3948167::US10239870, Example 70
SMILES Cn1c(SCCCN2CC[C@]3(C[C@@H]3c3ccc(cc3)C(F)(F)F)C2)nnc1C1CCOCC1
InChI Key InChIKey=PPLSEYBUMZWQHS-OFNKIYASSA-N
Data  9 KI  6 IC50
  Tab Delimited (TSV)   2D SDfile   Computed 3D by Vconf -m prep SDfile
Find this compound or compounds like it in BindingDB:
Activity Spreadsheet -- Enzyme Inhibition Constant Data from BindingDB
Found 15 hits for monomerid = 50192332
TargetD(3) dopamine receptor(Homo sapiens (Human))
Aptuit
Curated by ChEMBL
LigandPNGBDBM50192332(CHEMBL3948167 | US10239870, Example 70)
Affinity DataKi:  1.5nM. Assay description: Antagonist activity at human dopamine D3 receptor expressed in CHO cell membranes after 90 mins in presence of quinelorane by [35S]-GTPgammaS binding...
In DepthDetails ArticlePubMed
TargetD(3) dopamine receptor(Rattus norvegicus (Rat))
Indivior
US Patent
LigandPNGBDBM50192332(CHEMBL3948167 | US10239870, Example 70)
Affinity DataKi:  1.66nM. Assay description: [125I]-7OH-PIPAT Binding Assay at rat native D3 receptor on membranes from rat ventral striatum. Homogenates from frozen rat brain ventral striatum (...
In DepthDetails US Patent
TargetD(3) dopamine receptor(Homo sapiens (Human))
Aptuit
Curated by ChEMBL
LigandPNGBDBM50192332(CHEMBL3948167 | US10239870, Example 70)
Affinity DataKi:  1.70nM. Assay description: Displacement of [3H]-spiperone from human dopamine D3 receptor expressed in CHO-K1 cell membranes after 90 mins by liquid scintillation counting
In DepthDetails ArticlePubMed
TargetMuscarinic acetylcholine receptor M1(Homo sapiens (Human))
Aptuit
Curated by ChEMBL
LigandPNGBDBM50192332(CHEMBL3948167 | US10239870, Example 70)
Affinity DataKi:  251nM. Assay description: Activity at human muscarinic acetylcholine receptor M1 transfected in CHO-K1 cells assessed as intracellular calcium levels in presence of acetylchol...
In DepthDetails ArticlePubMed
TargetD(2) dopamine receptor(Homo sapiens (Human))
Indivior
US Patent
LigandPNGBDBM50192332(CHEMBL3948167 | US10239870, Example 70)
Affinity DataKi:  692nM. Assay description: CHO cells stably expressing human dopamine receptor type 2, long variant (hD2L), coupled to Gα16 protein (CHO-Gα16-hD2L) were seeded into b...
In DepthDetails US Patent
TargetD(2) dopamine receptor(Homo sapiens (Human))
Indivior
US Patent
LigandPNGBDBM50192332(CHEMBL3948167 | US10239870, Example 70)
Affinity DataKi:  692nM. Assay description: Antagonist activity at human dopamine D2L receptor expressed in CHO cells coexpressing Galpha16 assessed as inhibition of dopamine-induced Ca2+ stimu...
In DepthDetails ArticlePubMed
TargetD(2) dopamine receptor(Homo sapiens (Human))
Indivior
US Patent
LigandPNGBDBM50192332(CHEMBL3948167 | US10239870, Example 70)
Affinity DataKi:  813nM. Assay description: Displacement of [3H]-spiperone from human dopamine D2 receptor expressed in CHO-K1 cell membranes coexpressing Galpha16 after 120 mins by liquid scin...
In DepthDetails ArticlePubMed
TargetD(2) dopamine receptor(Homo sapiens (Human))
Indivior
US Patent
LigandPNGBDBM50192332(CHEMBL3948167 | US10239870, Example 70)
Affinity DataKi:  813nM. Assay description: CHO cells stably expressing human dopamine receptor type 2, long variant (hD2L), coupled to Gα16 protein (CHO-Gα16-hD2L) were re-suspended ...
In DepthDetails US Patent
TargetMuscarinic acetylcholine receptor M3(Homo sapiens (Human))
Aptuit
Curated by ChEMBL
LigandPNGBDBM50192332(CHEMBL3948167 | US10239870, Example 70)
Affinity DataKi:  891nM. Assay description: Activity at human muscarinic acetylcholine receptor M3 transfected in CHO-K1 cells assessed as intracellular calcium levels in presence of acetylchol...
In DepthDetails ArticlePubMed
TargetCytochrome P450 2D6(Homo sapiens (Human))
Aptuit
Curated by ChEMBL
LigandPNGBDBM50192332(CHEMBL3948167 | US10239870, Example 70)
Affinity DataIC50: >1.00E+4nM. Assay description: Inhibition of human CYP2D6 expressed in microsomes using MMC as substrate after 10 mins by P450 cypex assay
In DepthDetails ArticlePubMed
TargetCytochrome P450 3A4(Homo sapiens (Human))
Aptuit
Curated by ChEMBL
LigandPNGBDBM50192332(CHEMBL3948167 | US10239870, Example 70)
Affinity DataIC50: >1.00E+4nM. Assay description: Inhibition of human CYP3A4 expressed in microsomes using DEF as substrate after 10 mins by P450 cypex assay
In DepthDetails ArticlePubMed
TargetCytochrome P450 2C19(Homo sapiens (Human))
Aptuit
Curated by ChEMBL
LigandPNGBDBM50192332(CHEMBL3948167 | US10239870, Example 70)
Affinity DataIC50: >1.00E+4nM. Assay description: Inhibition of human CYP2C19 expressed in microsomes using BMC as substrate after 10 mins by P450 cypex assay
In DepthDetails ArticlePubMed
TargetCytochrome P450 2C9(Homo sapiens (Human))
Aptuit
Curated by ChEMBL
LigandPNGBDBM50192332(CHEMBL3948167 | US10239870, Example 70)
Affinity DataIC50: >1.00E+4nM. Assay description: Inhibition of human CYP2C9 expressed in microsomes using FCA as substrate after 10 mins by P450 cypex assay
In DepthDetails ArticlePubMed
TargetCytochrome P450 1A2(Homo sapiens (Human))
Aptuit
Curated by ChEMBL
LigandPNGBDBM50192332(CHEMBL3948167 | US10239870, Example 70)
Affinity DataIC50: >1.00E+4nM. Assay description: Inhibition of human CYP1A2 expressed in microsomes using ER as substrate after 10 mins by P450 cypex assay
In DepthDetails ArticlePubMed
TargetPotassium voltage-gated channel subfamily H member 2(Homo sapiens (Human))
Aptuit
Curated by ChEMBL
LigandPNGBDBM50192332(CHEMBL3948167 | US10239870, Example 70)
Affinity DataIC50:  2.95E+3nM. Assay description: Inhibition of human ERG transfected in HEK293 cells assessed as reduction in tail current by patch clamp assay
In DepthDetails ArticlePubMed